Imputation,id,RecordId,ReportingCountry,Gender,FirstCD4Count,FirstCD4DateYear,FirstCD4DateQuarter,FirstCD4DateMonth,FirstCD4DateWeek,FirstCD4DateDay,DateOfAIDSDiagnosisYear,DateOfAIDSDiagnosisQuarter,DateOfAIDSDiagnosisMonth,DateOfAIDSDiagnosisWeek,DateOfAIDSDiagnosisDay,DateOfDeathYear,DateOfDiagnosisYear,DateOfDiagnosisQuarter,DateOfDiagnosisMonth,DateOfDiagnosisWeek,DateOfDiagnosisDay,DateOfNotificationYear,DateOfNotificationQuarter,CountryOfBirth,CountryOfNationality,RegionOfOrigin,PlaceOfNotification,PlaceOfResidence,Outcome,RegionOfBirth,RegionOfNationality,FullRegionOfOrigin,GroupOfOrigin,AIDS,NotificationTime,DiagnosisTime,MinNotificationTime,MaxNotificationTime,VarX,TweakedVarX,MaxPossibleDelay,TweakedMaxPossibleDelay,OrigSort,DY,Age,SqCD4,Transmission,GroupedRegionOfOrigin
1,1,1,BE,M,,,,,,,1989,4,12,1989-50,15,1990,1985,2,6,1985-26,30,1985,2,BE,,REPCOUNTRY,,HIVAIDS,,REPCOUNTRY,,REPCOUNTRY,Reporting Country,AIDS-No,1985.5,1985.5,1985.25,2018,0,0.01,130,130,1,0,28,8.94427190999916,MSM,REPCOUNTRY
1,2,2,BE,M,,,,,,,1992,3,8,1992-33,14,1995,1985,3,7,1985-31,29,1985,3,BE,,REPCOUNTRY,,HIVAIDS,,REPCOUNTRY,,REPCOUNTRY,Reporting Country,AIDS-No,1985.75,1985.75,1985.25,2018,0,0.01,129,129,2,0,40,0,MSM,REPCOUNTRY
1,3,3,BE,M,,,,,,,,,,,15,,1985,4,12,1985-49,5,1985,4,,,,,HIVAIDS,,,,,,AIDS-No,1986,1986,1985.25,2018,0,0.01,128,128,3,0,41,21.3072757526625,HETERO,REPCOUNTRY
1,1,4,BE,F,,,,,,,,,,,15,,1985,3,9,1985-36,6,1985,3,,,,,HIVAIDS,,,,,,AIDS-No,1985.75,1985.75,1985.25,2018,0,0.01,129,129,4,0,26,0,HETERO,SUBAFR
1,4,5,BE,M,,,,,,,1990,4,12,1990-50,15,1991,1985,3,8,1985-31,1,1985,3,BE,,REPCOUNTRY,,HIVAIDS,,REPCOUNTRY,,REPCOUNTRY,Reporting Country,AIDS-No,1985.75,1985.75,1985.25,2018,0,0.01,129,129,5,0,31,2,MSM,REPCOUNTRY
1,5,6,BE,M,,,,,,,,,,,15,,1985,4,10,1985-43,22,1985,4,BE,,REPCOUNTRY,,HIVAIDS,,REPCOUNTRY,,REPCOUNTRY,Reporting Country,AIDS-No,1986,1986,1985.25,2018,0,0.01,128,128,6,0,21,6.557438524302,MSM,REPCOUNTRY
1,6,7,BE,M,,,,,,,,,,,15,,1985,4,12,1985-50,11,1985,4,,,SUBAFR,,HIVAIDS,,,,SUBAFR,SSA,AIDS-No,1986,1986,1985.25,2018,0,0.01,128,128,7,0,40,0,HETERO,SUBAFR
1,7,8,BE,M,,,,,,,1987,2,4,1987-14,1,1987,1985,3,9,1985-39,24,1985,3,BE,,REPCOUNTRY,,HIVAIDS,,REPCOUNTRY,,REPCOUNTRY,Reporting Country,AIDS-No,1985.75,1985.75,1985.25,2018,0,0.01,129,129,8,0,35,12.369316876853,MSM,REPCOUNTRY
1,8,9,BE,M,,,,,,,,,,,15,,1985,4,12,1985-48,1,1985,4,MA,,NORTHAFRMIDEAST,,HIVAIDS,,NORTHAFRMIDEAST,,NORTHAFRMIDEAST,Other Country,AIDS-No,1986,1986,1985.25,2018,0,0.01,128,128,9,0,24,9.48683298050514,IDU,NORTHAFRMIDEAST
1,9,10,BE,M,,,,,,,,,,,15,,1985,4,12,1985-50,12,1985,4,BE,,REPCOUNTRY,,HIVAIDS,,REPCOUNTRY,,REPCOUNTRY,Reporting Country,AIDS-No,1986,1986,1985.25,2018,0,0.01,128,128,10,0,26,0,MSM,REPCOUNTRY
1,10,11,BE,M,,,,,,,1996,1,1,1996-03,20,,1985,2,6,1985-26,30,1985,2,BE,,REPCOUNTRY,,HIVAIDS,,REPCOUNTRY,,REPCOUNTRY,Reporting Country,AIDS-No,1985.5,1985.5,1985.25,2018,0,0.01,130,130,11,0,19,0,IDU,REPCOUNTRY
1,11,12,BE,M,,,,,,,,,,,15,,1985,4,12,1985-51,20,1985,4,BE,,REPCOUNTRY,,HIVAIDS,,REPCOUNTRY,,REPCOUNTRY,Reporting Country,AIDS-No,1986,1986,1985.25,2018,0,0.01,128,128,12,0,33,22.3830292855994,MSM,REPCOUNTRY
1,2,13,BE,F,,,,,,,,,,,15,,1985,4,10,1985-44,29,1985,4,,,,,HIVAIDS,,,,,,AIDS-No,1986,1986,1985.25,2018,0,0.01,128,128,13,0,20,0,HETERO,SUBAFR
1,3,14,BE,F,10,1985,2,6,1985-24,,2002,1,1,2002-02,10,,1985,2,6,1985-24,15,1985,2,BE,,REPCOUNTRY,,HIVAIDS,,REPCOUNTRY,,REPCOUNTRY,Reporting Country,AIDS-No,1985.5,1985.5,1985.25,2018,0,0.01,130,130,14,0,21,3.16227766016838,HETERO,REPCOUNTRY
1,4,15,BE,F,,,,,,,1992,1,2,1992-07,15,1993,1985,4,12,1985-49,6,1985,4,,,SUBAFR,,HIVAIDS,,,,SUBAFR,SSA,AIDS-No,1986,1986,1985.25,2018,0,0.01,128,128,15,0,25,18.2482875908947,HETERO,SUBAFR
1,12,16,BE,M,,,,,,,,,,,15,,1985,4,12,1985-51,20,1985,4,BE,,REPCOUNTRY,,HIVAIDS,,REPCOUNTRY,,REPCOUNTRY,Reporting Country,AIDS-No,1986,1986,1985.25,2018,0,0.01,128,128,16,0,38,5.8309518948453,HETERO,REPCOUNTRY
1,13,17,BE,M,,,,,,,1989,4,12,1989-50,15,1990,1985,3,7,1985-27,1,1985,3,,,EUROPE,,HIVAIDS,,,,EUROPE,Other Country,AIDS-No,1985.75,1985.75,1985.25,2018,0,0.01,129,129,17,0,30,22.3830292855994,MSM,EUROPE
1,14,18,BE,M,0,1985,2,6,1985-24,,,,,,15,,1985,2,6,1985-24,15,1985,2,,,,,HIVAIDS,,,,,,AIDS-No,1985.5,1985.5,1985.25,2018,0,0.01,130,130,18,0,37,0,MSM,REPCOUNTRY
1,5,19,BE,F,,,,,,,1990,2,5,1990-20,15,1992,1985,1,3,1985-09,1,1985,1,,,SUBAFR,,HIVAIDS,,,,SUBAFR,SSA,AIDS-No,1985.25,1985.25,1985.25,2018,0,0.01,131,131,19,0,45,0,HETERO,SUBAFR
1,15,20,BE,M,,,,,,,1985,1,2,1985-07,15,,1985,1,2,1985-07,15,1985,1,,,SUBAFR,,HIVAIDS,,,,SUBAFR,SSA,AIDS-Yes,1985.25,1985.25,1985.25,2018,0,0.01,131,131,20,0,35,3.60555127546399,HETERO,SUBAFR
1,16,21,BE,M,,,,,,,1986,2,6,1986-24,15,1989,1985,4,12,1985-52,23,1985,4,,,SUBAFR,,HIVAIDS,,,,SUBAFR,SSA,AIDS-Yes,1986,1986,1985.25,2018,0,0.01,128,128,21,0,32,0,HETERO,SUBAFR
1,17,22,BE,M,,,,,,,,,,,15,,1985,4,12,1985-49,6,1985,4,BE,,REPCOUNTRY,,HIVAIDS,,REPCOUNTRY,,REPCOUNTRY,Reporting Country,AIDS-No,1986,1986,1985.25,2018,0,0.01,128,128,22,0,23,2.44948974278318,MSM,REPCOUNTRY
1,18,23,BE,M,,,,,,,1989,3,9,1989-37,15,2011,1985,2,5,1985-19,9,1985,2,BE,,REPCOUNTRY,,HIVAIDS,,REPCOUNTRY,,REPCOUNTRY,Reporting Country,AIDS-No,1985.5,1985.5,1985.25,2018,0,0.01,130,130,23,0,7,2.44948974278318,TRANSFU,REPCOUNTRY
1,6,24,BE,F,,,,,,,,,,,15,,1985,1,2,1985-07,13,1985,1,,,SUBAFR,,HIVAIDS,,,,SUBAFR,SSA,AIDS-No,1985.25,1985.25,1985.25,2018,0,0.01,131,131,24,0,25,18.2482875908947,HETERO,SUBAFR
1,19,25,BE,M,,,,,,,,,,,15,,1985,4,12,1985-51,20,1985,4,BE,,REPCOUNTRY,,HIVAIDS,,REPCOUNTRY,,REPCOUNTRY,Reporting Country,AIDS-No,1986,1986,1985.25,2018,0,0.01,128,128,25,0,26,0,IDU,REPCOUNTRY
1,20,26,BE,M,,,,,,,1993,4,11,1993-45,10,,1985,2,6,1985-26,30,1985,2,BE,,REPCOUNTRY,,HIVAIDS,,REPCOUNTRY,,REPCOUNTRY,Reporting Country,AIDS-No,1985.5,1985.5,1985.25,2018,0,0.01,130,130,26,0,24,20.6155281280883,MSM,REPCOUNTRY
1,21,27,BE,M,,,,,,,1991,3,9,1991-36,5,1996,1985,4,11,1985-45,5,1985,4,,,NORTHAFRMIDEAST,,HIVAIDS,,,,NORTHAFRMIDEAST,Other Country,AIDS-No,1986,1986,1985.25,2018,0,0.01,128,128,27,0,23,0,IDU,NORTHAFRMIDEAST
1,22,28,BE,M,,,,,,,1995,4,11,1995-47,23,,1985,4,10,1985-40,1,1985,4,BE,,REPCOUNTRY,,HIVAIDS,,REPCOUNTRY,,REPCOUNTRY,Reporting Country,AIDS-No,1986,1986,1985.25,2018,0,0.01,128,128,28,0,38,18.8148877222268,MSM,REPCOUNTRY
1,23,29,BE,M,,,,,,,,,,,15,,1985,3,9,1985-39,24,1985,3,,,,,HIVAIDS,,,,,,AIDS-No,1985.75,1985.75,1985.25,2018,0,0.01,129,129,29,0,28,11.2694276695846,HETERO,SUBAFR
1,24,30,BE,M,0,1985,4,11,1985-47,,,,,,15,,1985,4,11,1985-47,18,1985,4,,,,,HIVAIDS,,,,,,AIDS-No,1986,1986,1985.25,2018,0,0.01,128,128,30,0,27,0,MSM,REPCOUNTRY
1,7,31,BE,F,,,,,,,,,,,15,,1985,4,11,1985-45,4,1985,4,,,,,HIVAIDS,,,,,,AIDS-No,1986,1986,1985.25,2018,0,0.01,128,128,31,0,31,18.2482875908947,IDU,REPCOUNTRY
1,8,32,BE,F,,,,,,,1993,3,8,1993-32,9,1997,1985,4,11,1985-47,18,1985,4,BE,,REPCOUNTRY,,HIVAIDS,,REPCOUNTRY,,REPCOUNTRY,Reporting Country,AIDS-No,1986,1986,1985.25,2018,0,0.01,128,128,32,0,21,21.7944947177034,IDU,REPCOUNTRY
1,25,33,BE,M,,,,,,,1997,3,8,1997-33,15,,1985,1,3,1985-13,29,1985,1,BE,,REPCOUNTRY,,HIVAIDS,,REPCOUNTRY,,REPCOUNTRY,Reporting Country,AIDS-No,1985.25,1985.25,1985.25,2018,0,0.01,131,131,33,0,23,6,TRANSFU,REPCOUNTRY
1,26,34,BE,M,,,,,,,1990,2,5,1990-20,15,1991,1985,4,12,1985-51,17,1985,4,BE,,REPCOUNTRY,,HIVAIDS,,REPCOUNTRY,,REPCOUNTRY,Reporting Country,AIDS-No,1986,1986,1985.25,2018,0,0.01,128,128,34,0,18,0,TRANSFU,REPCOUNTRY
1,27,35,BE,M,,,,,,,1990,4,10,1990-42,15,1992,1985,2,6,1985-26,30,1985,2,BE,,REPCOUNTRY,,HIVAIDS,,REPCOUNTRY,,REPCOUNTRY,Reporting Country,AIDS-No,1985.5,1985.5,1985.25,2018,0,0.01,130,130,35,0,23,0,MSM,REPCOUNTRY
1,28,36,BE,M,,,,,,,,,,,15,,1985,3,7,1985-27,1,1985,3,,,,,HIVAIDS,,,,,,AIDS-No,1985.75,1985.75,1985.25,2018,0,0.01,129,129,36,0,47,0,HETERO,REPCOUNTRY
1,29,37,BE,M,,,,,,,1992,4,12,1992-50,7,1994,1985,4,11,1985-47,19,1985,4,BE,,REPCOUNTRY,,HIVAIDS,,REPCOUNTRY,,REPCOUNTRY,Reporting Country,AIDS-No,1986,1986,1985.25,2018,0,0.01,128,128,37,0,31,0,MSM,REPCOUNTRY
1,30,38,BE,M,,,,,,,1987,4,11,1987-46,15,1988,1985,4,10,1985-40,1,1985,4,BE,,REPCOUNTRY,,HIVAIDS,,REPCOUNTRY,,REPCOUNTRY,Reporting Country,AIDS-No,1986,1986,1985.25,2018,0,0.01,128,128,38,0,29,9.8488578017961,MSM,REPCOUNTRY
1,31,39,BE,M,,,,,,,,,,,15,,1985,2,4,1985-14,1,1985,2,,,,,HIVAIDS,,,,,,AIDS-No,1985.5,1985.5,1985.25,2018,0,0.01,130,130,39,0,49,0,HETERO,REPCOUNTRY
1,32,40,BE,M,,,,,,,1987,4,11,1987-46,15,1989,1985,4,10,1985-42,14,1985,4,BE,,REPCOUNTRY,,HIVAIDS,,REPCOUNTRY,,REPCOUNTRY,Reporting Country,AIDS-No,1986,1986,1985.25,2018,0,0.01,128,128,40,0,29,6.92820323027551,MSM,REPCOUNTRY
1,9,41,BE,F,,,,,,,1992,4,11,1992-45,5,1993,1985,4,10,1985-40,1,1985,4,,,EUROPE,,HIVAIDS,,,,EUROPE,Other Country,AIDS-No,1986,1986,1985.25,2018,0,0.01,128,128,41,0,33,18.2482875908947,HETERO,EUROPE
1,33,42,BE,M,,,,,,,,,,,15,,1985,4,12,1985-52,24,1985,4,,,,,HIVAIDS,,,,,,AIDS-No,1986,1986,1985.25,2018,0,0.01,128,128,42,0,77,0,HETERO,SUBAFR
1,34,43,BE,M,,,,,,,1994,2,6,1994-24,15,2002,1985,2,6,1985-24,15,1985,2,BE,,REPCOUNTRY,,HIVAIDS,,REPCOUNTRY,,REPCOUNTRY,Reporting Country,AIDS-No,1985.5,1985.5,1985.25,2018,0,0.01,130,130,43,0,47,6.70820393249937,TRANSFU,REPCOUNTRY
1,35,44,BE,M,,,,,,,1989,2,6,1989-26,30,1997,1985,4,12,1986-01,30,1985,4,,,,,HIVAIDS,,,,,,AIDS-No,1986,1986,1985.25,2018,0,0.01,128,128,44,0,8,13.1909059582729,TRANSFU,REPCOUNTRY
1,36,45,BE,M,,,,,,,,,,,15,,1985,1,1,1985-05,31,1985,1,,,SUBAFR,,HIVAIDS,,,,SUBAFR,SSA,AIDS-No,1985.25,1985.25,1985.25,2018,0,0.01,131,131,45,0,43,0,HETERO,SUBAFR
1,37,46,BE,M,,,,,,,1994,3,8,1994-33,15,1995,1985,2,6,1985-26,30,1985,2,,,NORTHAFRMIDEAST,,HIVAIDS,,,,NORTHAFRMIDEAST,Other Country,AIDS-No,1985.5,1985.5,1985.25,2018,0,0.01,130,130,46,0,26,17.9443584449264,IDU,NORTHAFRMIDEAST
1,10,47,BE,F,0,1985,3,7,1985-28,,,,,,15,,1985,3,7,1985-28,12,1985,3,,,,,HIVAIDS,,,,,,AIDS-No,1985.75,1985.75,1985.25,2018,0,0.01,129,129,47,0,34,0,HETERO,SUBAFR
1,38,48,BE,M,,,,,,,,,,,15,,1985,4,12,1985-51,20,1985,4,BE,,REPCOUNTRY,,HIVAIDS,,REPCOUNTRY,,REPCOUNTRY,Reporting Country,AIDS-No,1986,1986,1985.25,2018,0,0.01,128,128,48,0,26,6.70820393249937,MSM,REPCOUNTRY
1,11,49,BE,F,,,,,,,,,,,15,,1985,3,9,1985-37,10,1985,3,,,,,HIVAIDS,,,,,,AIDS-No,1985.75,1985.75,1985.25,2018,0,0.01,129,129,49,0,32,0,HETERO,SUBAFR
1,39,50,BE,M,,,,,,,,,,,15,,1985,4,12,1985-49,6,1985,4,,,,,HIVAIDS,,,,,,AIDS-No,1986,1986,1985.25,2018,0,0.01,128,128,50,0,23,0,MSM,REPCOUNTRY
1,40,51,BE,M,,,,,,,1991,2,5,1991-20,15,1992,1985,2,6,1985-26,30,1985,2,BE,,REPCOUNTRY,,HIVAIDS,,REPCOUNTRY,,REPCOUNTRY,Reporting Country,AIDS-No,1985.5,1985.5,1985.25,2018,0,0.01,130,130,51,0,28,8.94427190999916,MSM,REPCOUNTRY
1,41,52,BE,M,,,,,,,1993,4,12,1993-49,9,1994,1985,2,6,1985-22,1,1985,2,BE,,REPCOUNTRY,,HIVAIDS,,REPCOUNTRY,,REPCOUNTRY,Reporting Country,AIDS-No,1985.5,1985.5,1985.25,2018,0,0.01,130,130,52,0,41,6,MSM,REPCOUNTRY
1,42,53,BE,M,,,,,,,,,,,15,,1985,3,9,1985-39,24,1985,3,BE,,REPCOUNTRY,,HIVAIDS,,REPCOUNTRY,,REPCOUNTRY,Reporting Country,AIDS-No,1985.75,1985.75,1985.25,2018,0,0.01,129,129,53,0,14,17.7200451466694,TRANSFU,REPCOUNTRY
1,43,54,BE,M,,,,,,,1987,3,8,1987-35,26,1994,1985,4,10,1985-42,15,1985,4,,,SUBAFR,,HIVAIDS,,,,SUBAFR,SSA,AIDS-No,1986,1986,1985.25,2018,0,0.01,128,128,54,0,36,0,HETERO,SUBAFR
1,12,55,BE,F,,,,,,,,,,,15,,1985,2,6,1985-24,15,1985,2,,,,,HIVAIDS,,,,,,AIDS-No,1985.5,1985.5,1985.25,2018,0,0.01,130,130,55,0,26,0,TRANSFU,REPCOUNTRY
1,44,56,BE,M,,,,,,,,,,,15,,1985,4,11,1985-48,27,1985,4,,,,,HIVAIDS,,,,,,AIDS-No,1986,1986,1985.25,2018,0,0.01,128,128,56,0,27,0,MSM,REPCOUNTRY
1,13,57,BE,F,,,,,,,,,,,15,,1985,4,12,1985-52,23,1985,4,,,SUBAFR,,HIVAIDS,,,,SUBAFR,SSA,AIDS-No,1986,1986,1985.25,2018,0,0.01,128,128,57,0,27,0,HETERO,SUBAFR
1,14,58,BE,F,,,,,,,,,,,15,,1985,3,8,1985-34,23,1985,3,,,SUBAFR,,HIVAIDS,,,,SUBAFR,SSA,AIDS-No,1985.75,1985.75,1985.25,2018,0,0.01,129,129,58,0,0,35.4400902933387,MTCT,SUBAFR
1,45,59,BE,M,,,,,,,1989,1,1,1989-02,15,1992,1985,4,12,1985-48,1,1985,4,BE,,REPCOUNTRY,,HIVAIDS,,REPCOUNTRY,,REPCOUNTRY,Reporting Country,AIDS-No,1986,1986,1985.25,2018,0,0.01,128,128,59,0,31,16.2480768092719,MSM,REPCOUNTRY
1,46,60,BE,M,,,,,,,,,,,15,,1985,4,12,1985-49,6,1985,4,,,,,HIVAIDS,,,,,,AIDS-No,1986,1986,1985.25,2018,0,0.01,128,128,60,0,27,0,MSM,REPCOUNTRY
1,15,61,BE,F,,,,,,,1985,2,5,1985-20,15,1985,1985,2,5,1985-20,15,1985,2,,,SUBAFR,,HIVAIDS,,,,SUBAFR,SSA,AIDS-Yes,1985.5,1985.5,1985.25,2018,0,0.01,130,130,61,0,37,0,HETERO,SUBAFR
1,47,62,BE,M,,,,,,,1985,4,10,1985-42,15,,1985,4,10,1985-42,15,1985,4,BE,,REPCOUNTRY,,HIVAIDS,,REPCOUNTRY,,REPCOUNTRY,Reporting Country,AIDS-Yes,1986,1986,1985.25,2018,0,0.01,128,128,62,0,49,0,MSM,REPCOUNTRY
1,48,63,BE,M,,,,,,,1992,3,8,1992-33,12,,1985,4,11,1985-46,15,1985,4,BE,,REPCOUNTRY,,HIVAIDS,,REPCOUNTRY,,REPCOUNTRY,Reporting Country,AIDS-No,1986,1986,1985.25,2018,0,0.01,128,128,63,0,33,0,MSM,REPCOUNTRY
1,49,64,BE,M,,,,,,,1985,2,4,1985-16,15,1985,1985,2,4,1985-16,15,1985,2,,,NORTHAFRMIDEAST,,HIVAIDS,,,,NORTHAFRMIDEAST,Other Country,AIDS-Yes,1985.5,1985.5,1985.25,2018,0,0.01,130,130,64,0,25,0,IDU,NORTHAFRMIDEAST
1,16,65,BE,F,1299,1985,4,12,1985-50,,,,,,15,,1985,4,12,1985-50,9,1985,4,MA,,NORTHAFRMIDEAST,,HIVAIDS,,NORTHAFRMIDEAST,,NORTHAFRMIDEAST,Other Country,AIDS-No,1986,1986,1985.25,2018,0,0.01,128,128,65,0,18,36.0416425818802,HETERO,NORTHAFRMIDEAST
1,17,66,BE,F,,,,,,,1992,2,4,1992-16,15,1998,1985,2,6,1985-26,30,1985,2,,,SUBAFR,,HIVAIDS,,,,SUBAFR,SSA,AIDS-No,1985.5,1985.5,1985.25,2018,0,0.01,130,130,66,0,36,18.2482875908947,HETERO,SUBAFR
1,50,67,BE,M,,,,,,,1994,1,2,1994-07,15,,1985,2,6,1985-24,15,1985,2,BE,,REPCOUNTRY,,HIVAIDS,,REPCOUNTRY,,REPCOUNTRY,Reporting Country,AIDS-No,1985.5,1985.5,1985.25,2018,0,0.01,130,130,67,0,35,25.7681974534503,MSM,REPCOUNTRY
1,18,68,BE,F,,,,,,,1991,4,11,1991-46,15,1995,1985,2,5,1985-21,24,1985,2,,,SUBAFR,,HIVAIDS,,,,SUBAFR,SSA,AIDS-No,1985.5,1985.5,1985.25,2018,0,0.01,130,130,68,0,30,0,HETERO,SUBAFR
1,51,69,BE,M,,,,,,,,,,,15,,1985,4,12,1985-51,16,1985,4,,,,,HIVAIDS,,,,,,AIDS-No,1986,1986,1985.25,2018,0,0.01,128,128,69,0,30,9.48683298050514,MSM,REPCOUNTRY
1,52,70,BE,M,,,,,,,1985,3,8,1985-33,15,,1985,3,8,1985-33,15,1985,3,,,SUBAFR,,HIVAIDS,,,,SUBAFR,SSA,AIDS-Yes,1985.75,1985.75,1985.25,2018,0,0.01,129,129,70,0,42,9.21954445729289,HETERO,SUBAFR
1,53,71,BE,M,,,,,,,1991,4,10,1991-42,15,2016,1985,2,6,1985-26,30,1985,2,,,NORTHAFRMIDEAST,,HIVAIDS,,,,NORTHAFRMIDEAST,Other Country,AIDS-No,1985.5,1985.5,1985.25,2018,0,0.01,130,130,71,0,21,0,IDU,NORTHAFRMIDEAST
1,54,72,BE,M,,,,,,,1986,1,3,1986-11,15,,1985,2,4,1985-16,15,1985,2,BE,,REPCOUNTRY,,HIVAIDS,,REPCOUNTRY,,REPCOUNTRY,Reporting Country,AIDS-Yes,1985.5,1985.5,1985.25,2018,0,0.01,130,130,72,0,23,3.60555127546399,MSM,REPCOUNTRY
1,55,73,BE,M,,,,,,,,,,,15,,1985,3,9,1985-38,16,1985,3,,,EUROPE,,HIVAIDS,,,,EUROPE,Other Country,AIDS-No,1985.75,1985.75,1985.25,2018,0,0.01,129,129,73,0,26,6.92820323027551,MSM,EUROPE
1,56,74,BE,M,,,,,,,,,,,15,,1985,3,9,1985-36,6,1985,3,,,,,HIVAIDS,,,,,,AIDS-No,1985.75,1985.75,1985.25,2018,0,0.01,129,129,74,0,22,19.1833260932509,MSM,REPCOUNTRY
1,57,75,BE,M,,,,,,,1988,2,5,1988-19,15,1990,1985,2,5,1985-18,2,1985,2,BE,,REPCOUNTRY,,HIVAIDS,,REPCOUNTRY,,REPCOUNTRY,Reporting Country,AIDS-No,1985.5,1985.5,1985.25,2018,0,0.01,130,130,75,0,43,0,MSM,REPCOUNTRY
1,58,76,BE,M,,,,,,,,,,,15,,1985,3,8,1985-31,1,1985,3,,,SUBAFR,,HIVAIDS,,,,SUBAFR,SSA,AIDS-No,1985.75,1985.75,1985.25,2018,0,0.01,129,129,76,0,30,0,TRANSFU,SUBAFR
1,19,77,BE,F,,,,,,,1985,3,7,1985-29,15,,1985,3,7,1985-29,15,1985,3,,,SUBAFR,,HIVAIDS,,,,SUBAFR,SSA,AIDS-Yes,1985.75,1985.75,1985.25,2018,0,0.01,129,129,77,0,26,0,HETERO,SUBAFR
1,59,78,BE,M,,,,,,,,,,,15,,1985,4,12,1986-01,30,1985,4,,,SUBAFR,,HIVAIDS,,,,SUBAFR,SSA,AIDS-No,1986,1986,1985.25,2018,0,0.01,128,128,78,0,37,0,HETERO,SUBAFR
1,60,79,BE,M,,,,,,,1989,2,5,1989-20,15,,1985,2,6,1985-26,30,1985,2,,,SUBAFR,,HIVAIDS,,,,SUBAFR,SSA,AIDS-No,1985.5,1985.5,1985.25,2018,0,0.01,130,130,79,0,32,0,TRANSFU,SUBAFR
1,61,80,BE,M,,,,,,,1990,2,5,1990-20,15,1990,1985,1,1,1985-01,1,1985,1,BE,,REPCOUNTRY,,HIVAIDS,,REPCOUNTRY,,REPCOUNTRY,Reporting Country,AIDS-No,1985.25,1985.25,1985.25,2018,0,0.01,131,131,80,0,24,9.48683298050514,MSM,REPCOUNTRY
1,62,81,BE,M,,,,,,,1992,3,7,1992-27,1,1994,1985,2,6,1985-26,30,1985,2,BE,,REPCOUNTRY,,HIVAIDS,,REPCOUNTRY,,REPCOUNTRY,Reporting Country,AIDS-No,1985.5,1985.5,1985.25,2018,0,0.01,130,130,81,0,27,12.6491106406735,MSM,REPCOUNTRY
1,63,82,BE,M,0,1985,4,10,1985-41,,,,,,15,,1985,4,10,1985-41,11,1985,4,BE,,REPCOUNTRY,,HIVAIDS,,REPCOUNTRY,,REPCOUNTRY,Reporting Country,AIDS-No,1986,1986,1985.25,2018,0,0.01,128,128,82,0,22,0,HETERO,REPCOUNTRY
1,64,83,BE,M,,,,,,,1989,4,12,1989-50,15,1991,1985,3,9,1985-37,9,1985,3,BE,,REPCOUNTRY,,HIVAIDS,,REPCOUNTRY,,REPCOUNTRY,Reporting Country,AIDS-No,1985.75,1985.75,1985.25,2018,0,0.01,129,129,83,0,34,20,MSM,REPCOUNTRY
1,65,84,BE,M,,,,,,,1994,4,10,1994-41,15,1994,1985,2,6,1985-26,30,1985,2,BE,,REPCOUNTRY,,HIVAIDS,,REPCOUNTRY,,REPCOUNTRY,Reporting Country,AIDS-No,1985.5,1985.5,1985.25,2018,0,0.01,130,130,84,0,42,0,HETERO,REPCOUNTRY
1,66,85,BE,M,0,1985,3,8,1985-34,,,,,,15,,1985,3,8,1985-34,20,1985,3,,,,,HIVAIDS,,,,,,AIDS-No,1985.75,1985.75,1985.25,2018,0,0.01,129,129,85,0,31,0,MSM,REPCOUNTRY
1,67,86,BE,M,,,,,,,1987,4,10,1987-42,15,1987,1985,4,12,1985-52,23,1985,4,,,NORTHAFRMIDEAST,,HIVAIDS,,,,NORTHAFRMIDEAST,Other Country,AIDS-No,1986,1986,1985.25,2018,0,0.01,128,128,86,0,33,0,HETERO,NORTHAFRMIDEAST
1,68,87,BE,M,,,,,,,,,,,15,,1985,4,10,1985-43,25,1985,4,,,SUBAFR,,HIVAIDS,,,,SUBAFR,SSA,AIDS-No,1986,1986,1985.25,2018,0,0.01,128,128,87,0,0,0,MTCT,SUBAFR
1,20,88,BE,F,,,,,,,1985,2,4,1985-16,15,1986,1985,2,4,1985-16,15,1985,2,,,SUBAFR,,HIVAIDS,,,,SUBAFR,SSA,AIDS-Yes,1985.5,1985.5,1985.25,2018,0,0.01,130,130,88,0,21,0,HETERO,SUBAFR
1,69,89,BE,M,,,,,,,,,,,15,,1985,3,9,1985-37,10,1985,3,BE,,REPCOUNTRY,,HIVAIDS,,REPCOUNTRY,,REPCOUNTRY,Reporting Country,AIDS-No,1985.75,1985.75,1985.25,2018,0,0.01,129,129,89,0,43,0,MSM,REPCOUNTRY
1,21,90,BE,F,0,1985,4,10,1985-41,,,,,,15,,1985,4,10,1985-41,7,1985,4,,,,,HIVAIDS,,,,,,AIDS-No,1986,1986,1985.25,2018,0,0.01,128,128,90,0,26,0,TRANSFU,SUBAFR
1,70,91,BE,M,,,,,,,,,,,15,,1985,1,3,1985-12,19,1985,1,,,SUBAFR,,HIVAIDS,,,,SUBAFR,SSA,AIDS-No,1985.25,1985.25,1985.25,2018,0,0.01,131,131,91,0,49,3.60555127546399,HETERO,SUBAFR
1,71,92,BE,M,,,,,,,1991,3,9,1991-35,1,1992,1985,2,6,1985-26,30,1985,2,,,EUROPE,,HIVAIDS,,,,EUROPE,Other Country,AIDS-No,1985.5,1985.5,1985.25,2018,0,0.01,130,130,92,0,30,0,HETERO,EUROPE
1,72,93,BE,M,,,,,,,1987,4,11,1987-46,15,1991,1985,4,12,1985-50,15,1985,4,BE,,REPCOUNTRY,,HIVAIDS,,REPCOUNTRY,,REPCOUNTRY,Reporting Country,AIDS-No,1986,1986,1985.25,2018,0,0.01,128,128,93,0,56,0,MSM,REPCOUNTRY
1,73,94,BE,M,0,1985,4,12,1986-01,,,,,,15,,1985,4,12,1986-01,31,1985,4,,,,,HIVAIDS,,,,,,AIDS-No,1986,1986,1985.25,2018,0,0.01,128,128,94,0,31,0,MSM,REPCOUNTRY
1,22,95,BE,F,,,,,,,1987,2,6,1987-25,15,,1985,2,5,1985-21,21,1985,2,,,SUBAFR,,HIVAIDS,,,,SUBAFR,SSA,AIDS-No,1985.5,1985.5,1985.25,2018,0,0.01,130,130,95,0,31,0,HETERO,SUBAFR
1,74,96,BE,M,,,,,,,1991,2,6,1991-24,15,1995,1985,2,6,1985-26,30,1985,2,BE,,REPCOUNTRY,,HIVAIDS,,REPCOUNTRY,,REPCOUNTRY,Reporting Country,AIDS-No,1985.5,1985.5,1985.25,2018,0,0.01,130,130,96,0,33,20,MSM,REPCOUNTRY
1,75,97,BE,M,,,,,,,,,,,15,,1985,4,11,1985-47,22,1985,4,BE,,REPCOUNTRY,,HIVAIDS,,REPCOUNTRY,,REPCOUNTRY,Reporting Country,AIDS-No,1986,1986,1985.25,2018,0,0.01,128,128,97,0,20,8.24621125123532,MSM,REPCOUNTRY
1,76,98,BE,M,,,,,,,,,,,15,,1985,4,11,1985-47,18,1985,4,,,SUBAFR,,HIVAIDS,,,,SUBAFR,SSA,AIDS-No,1986,1986,1985.25,2018,0,0.01,128,128,98,0,36,0,HETERO,SUBAFR
1,23,99,BE,F,,,,,,,1987,4,11,1987-46,15,1988,1985,4,10,1985-43,22,1985,4,,,SUBAFR,,HIVAIDS,,,,SUBAFR,SSA,AIDS-No,1986,1986,1985.25,2018,0,0.01,128,128,99,0,25,0,HETERO,SUBAFR
1,24,100,BE,F,,,,,,,,,,,15,,1985,3,9,1985-39,24,1985,3,,,SUBAFR,,HIVAIDS,,,,SUBAFR,SSA,AIDS-No,1985.75,1985.75,1985.25,2018,0,0.01,129,129,100,0,30,18.2482875908947,TRANSFU,SUBAFR
1,77,101,BE,M,,,,,,,,,,,15,,1985,4,11,1985-47,20,1985,4,,,,,HIVAIDS,,,,,,AIDS-No,1986,1986,1985.25,2018,0,0.01,128,128,101,0,57,0,HETERO,REPCOUNTRY
1,78,102,BE,M,,,,,,,,,,,15,,1985,4,10,1985-41,8,1985,4,,,EUROPE,,HIVAIDS,,,,EUROPE,Other Country,AIDS-No,1986,1986,1985.25,2018,0,0.01,128,128,102,0,23,0,IDU,EUROPE
1,25,103,BE,F,,,,,,,1985,1,3,1985-11,15,1985,1985,1,3,1985-11,15,1985,1,,,SUBAFR,,HIVAIDS,,,,SUBAFR,SSA,AIDS-Yes,1985.25,1985.25,1985.25,2018,0,0.01,131,131,103,0,0,0,MTCT,SUBAFR
1,79,104,BE,M,,,,,,,1985,4,11,1985-46,15,1987,1985,4,11,1985-46,15,1985,4,,,SUBAFR,,HIVAIDS,,,,SUBAFR,SSA,AIDS-Yes,1986,1986,1985.25,2018,0,0.01,128,128,104,0,40,0,HETERO,SUBAFR
1,80,105,BE,M,,,,,,,1991,4,10,1991-42,15,1992,1985,1,3,1985-09,1,1985,1,BE,,REPCOUNTRY,,HIVAIDS,,REPCOUNTRY,,REPCOUNTRY,Reporting Country,AIDS-No,1985.25,1985.25,1985.25,2018,0,0.01,131,131,105,0,29,6.92820323027551,MSM,REPCOUNTRY
1,81,106,BE,M,,,,,,,,,,,15,,1985,3,8,1985-32,5,1985,3,,,,,HIVAIDS,,,,,,AIDS-No,1985.75,1985.75,1985.25,2018,0,0.01,129,129,106,0,55,0,MSM,EUROPE
1,82,107,BE,M,,,,,,,,,,,15,,1985,3,9,1985-37,9,1985,3,BE,,REPCOUNTRY,,HIVAIDS,,REPCOUNTRY,,REPCOUNTRY,Reporting Country,AIDS-No,1985.75,1985.75,1985.25,2018,0,0.01,129,129,107,0,33,22.3830292855994,MSM,REPCOUNTRY
1,26,108,BE,F,,,,,,,1985,3,7,1985-29,15,,1985,3,7,1985-29,15,1985,3,,,SUBAFR,,HIVAIDS,,,,SUBAFR,SSA,AIDS-Yes,1985.75,1985.75,1985.25,2018,0,0.01,129,129,108,0,32,0,HETERO,SUBAFR
1,83,109,BE,M,,,,,,,,,,,15,,1985,4,12,1985-49,4,1985,4,,,,,HIVAIDS,,,,,,AIDS-No,1986,1986,1985.25,2018,0,0.01,128,128,109,0,5,4.89897948556636,MSM,SUBAFR
1,27,110,BE,F,,,,,,,,,,,15,,1985,4,12,1985-52,26,1985,4,BE,,REPCOUNTRY,,HIVAIDS,,REPCOUNTRY,,REPCOUNTRY,Reporting Country,AIDS-No,1986,1986,1985.25,2018,0,0.01,128,128,110,0,28,0,HETERO,REPCOUNTRY
1,28,111,BE,F,,,,,,,1985,4,12,1985-50,15,1986,1985,4,12,1985-50,10,1985,4,BE,,REPCOUNTRY,,HIVAIDS,,REPCOUNTRY,,REPCOUNTRY,Reporting Country,AIDS-Yes,1986,1986,1985.25,2018,0,0.01,128,128,111,0,34,0,HETERO,REPCOUNTRY
1,29,112,BE,F,,,,,,,1985,3,8,1985-33,15,,1985,3,8,1985-33,15,1985,3,,,SUBAFR,,HIVAIDS,,,,SUBAFR,SSA,AIDS-Yes,1985.75,1985.75,1985.25,2018,0,0.01,129,129,112,0,25,0,HETERO,SUBAFR
1,84,113,BE,M,,,,,,,1990,3,8,1990-33,15,1990,1985,4,10,1985-40,1,1985,4,BE,,REPCOUNTRY,,HIVAIDS,,REPCOUNTRY,,REPCOUNTRY,Reporting Country,AIDS-No,1986,1986,1985.25,2018,0,0.01,128,128,113,0,39,0,TRANSFU,REPCOUNTRY
1,85,114,BE,M,,,,,,,,,,,15,,1985,4,11,1985-46,12,1985,4,BE,,REPCOUNTRY,,HIVAIDS,,REPCOUNTRY,,REPCOUNTRY,Reporting Country,AIDS-No,1986,1986,1985.25,2018,0,0.01,128,128,114,0,46,0,HETERO,REPCOUNTRY
1,30,115,BE,F,,,,,,,,,,,15,,1985,4,11,1985-48,28,1985,4,BE,,REPCOUNTRY,,HIVAIDS,,REPCOUNTRY,,REPCOUNTRY,Reporting Country,AIDS-No,1986,1986,1985.25,2018,0,0.01,128,128,115,0,31,0,HETERO,REPCOUNTRY
1,86,116,BE,M,,,,,,,,,,,15,,1985,4,12,1985-50,11,1985,4,BE,,REPCOUNTRY,,HIVAIDS,,REPCOUNTRY,,REPCOUNTRY,Reporting Country,AIDS-No,1986,1986,1985.25,2018,0,0.01,128,128,116,0,40,6,MSM,REPCOUNTRY
1,87,117,BE,M,85,1985,1,1,1985-03,,1985,1,1,1985-03,15,1986,1985,1,1,1985-03,15,1985,1,,,EUROPE,,HIVAIDS,,,,EUROPE,Other Country,AIDS-Yes,1985.25,1985.25,1985.25,2018,0,0.01,131,131,117,0,38,9.21954445729289,MSM,EUROPE
1,88,118,BE,M,,,,,,,1995,1,2,1995-05,1,,1985,4,11,1985-46,15,1985,4,BE,,REPCOUNTRY,,HIVAIDS,,REPCOUNTRY,,REPCOUNTRY,Reporting Country,AIDS-No,1986,1986,1985.25,2018,0,0.01,128,128,118,0,30,9.48683298050514,MSM,REPCOUNTRY
1,89,119,BE,M,,,,,,,,,,,15,,1985,3,7,1985-29,15,1985,3,,,EUROPE,,HIVAIDS,,,,EUROPE,Other Country,AIDS-No,1985.75,1985.75,1985.25,2018,0,0.01,129,129,119,0,33,25.7681974534503,IDU,EUROPE
1,90,120,BE,M,5,1985,2,6,1985-26,,1993,2,4,1993-15,14,1994,1985,2,6,1985-26,30,1985,2,BE,,REPCOUNTRY,,HIVAIDS,,REPCOUNTRY,,REPCOUNTRY,Reporting Country,AIDS-No,1985.5,1985.5,1985.25,2018,0,0.01,130,130,120,0,30,2.23606797749979,MSM,REPCOUNTRY
1,91,121,BE,M,,,,,,,,,,,15,,1985,3,7,1985-27,1,1985,3,,,,,HIVAIDS,,,,,,AIDS-No,1985.75,1985.75,1985.25,2018,0,0.01,129,129,121,0,33,3.74165738677394,MSM,REPCOUNTRY